Nmake Error U1045

Create an environment to build the C++ Boost libraries set in Widows for VS2013

RECOMMENDED: If you have Windows errors then we strongly recommend that you download and run this (Windows) Repair Tool.

NMAKE Errors U1000 through U4011 NMAKE Fatal Error U1045. NMAKE Fatal Error U1045. NMAKE Fatal Error U1045. NMAKE Fatal Error U1000. NMAKE Fatal Error U1001.

Aug 15, 2012. You may need to play around with how large this needs to be, using trial-and- error. In many cases, this is a quick-and-dirty solution that will eliminate the need to modify the command and work out the syntax of find , xargs , etc. (though I realize there are other benefits to doing so). I believe that this is.

NMAKE/make fatal errors occur when building a component. NMAKE/make fatal errors occur when building a component in Rose. Error 1: NMAKE : fatal error U1045:.

This site uses cookies for analytics, personalized content and ads. By continuing to browse this site, you agree to this use. Learn more

I’m writing a program in c using Visual Studio 2010 and I am getting the following error: U1095:. Visual Studio 2010 error U1095, nmake. There is no nmake.

Explains that you receive an error message when you use the Microsoft Program Maintenance utility (NMAKE) to compile a makefile. To resolve the problem, make sure.

libpngを用いてPNGを24bppBMPに変換したいのですがうまくいきません。. C・C++・ C#. runtime error発生で困っています。 初めて質問させていただきますのでよろしく お願いいたします。 私はプログラミング知識は全く. その他([技術者向] コンピューター). nmakeでNMAKE : fatal error U1045. Microsoft SDKをインストールし.

NMAKE/make fatal errors occur when building a component in. Error 1: NMAKE : fatal error U1045: spawn. This variable is used by both the nmake and make.

spawn failed : message. A program or command called by NMAKE failed for the given reason.

Explains that you receive an error message when you use the Microsoft Program Maintenance utility (NMAKE) to compile a makefile. To resolve the problem.

2012年2月9日. 本文将不择手段搜集WINCE PB的各种编译不过的错误并给出解决方案或是相关 思路,搜集资料来源:本人编译出错后得到解决后的学习笔记,网上搜集的资料,朋友 的教导等,后面将会详细备注,大家一起交流。文章一式两份,一份在博客上,另外一 份放到论坛中,并实时更新。[电子技术论坛:http://bbs.armeasy.com.

2010년 2월 11일. src/corelib/global/qglobal.h(62) : fatal error. Just run nmake. To reconfigure, run nmake confclean and configure. 설치했던 windows CE SDK 관련 설정을 해주어야한다. set INCLUDE=C:Program. 커맨드 라인에서 컴파일하려면 nmake 를 사용하기 위해 다음 2가지 방법 중 하나를 사용하면 된다. 시작 – 실행 -.

Oracledbconsole Service Not Starting Error Code 2 Shazam is almost certain to continue to exist as a standalone app 2. This deal is. It doesn’t even have to be your site: you could test a REST API service on which you depend. There’s a limit of 100 steps and 2 minutes. Edit the test to: Add validations to check the received text

A program or command called by NMAKE failed for the given reason. When NMAKE calls another program—for example, the compiler or linker—the call may fail, or an.

NMAKE Fatal Error U1077 – msdn.microsoft.com – NMAKE Errors U1000 through U4011 NMAKE Fatal Error U1077. NMAKE Fatal Error U1045. To suppress this error and continue the NMAKE session,

NMAKE Fatal Error U1045. NMAKE Fatal Error U1045. NMAKE Fatal Error U1000. NMAKE Fatal Error U1001. NMAKE Fatal Error U1002. NMAKE Fatal Error U1003. NMAKE.

hi guys, sorry for posting it here, i think its the wrong category but i dont know where else to ask, i searched online for this error and found nothi

RECOMMENDED: Click here to fix Windows errors and improve system performance